idx,UoM Identifier,Class,BNP,Patient,SUBJECT,AGE,SEX,BMI,SMOKER,ALCOHOL,SAMPLING TIME,FAST/ NON F,Hb,WCC,PLT,MCV,PCV ,GLU,Na,K,UREA,CREAT,T.PROT.,ALB,GLOBULIN,ALT,ALP,BIL,CHOL,BETA-BLO,ACE-I,DIURET,ALD-A,CCB,ANTI-COAGULANTS,ANTI-PLATELETS,STATIN,ANTI DM Rx,DM,HYPERTENSION,ASTHMA,COPD,RYTHM,PPM,AMIODARONE,ISMO,ALLOPURINOL,DIGOXIN,NYHA,LVEDD,EF,AETIOLOGY,FLUID,Pseudouridine *,N-BNP,2-Oxoglutaric Acid *,950,2-hydroxy;2-methylpropanoic acid *,Erythritol *,Uric acid*,3030,Erythritol *,2097,2;4;6-Trihydroxypyrimidine,Threonic acid,Uric acid *,Myo-inositol *,Para-hydroxyphenylacetic acid,3021,Xylitol or ribitol ,158,Uric acid*,Xylose or isomer,Disaccharide,Para-cresol,Disaccharide,168,1251,Indole-3-acetic acid *,Glyceric acid,2;4-Dihydroxybutanoic Acid,904,Sucrose *,3019,Tetronic acid,Dehydroascorbic acid

1,HF1,Disease,,BH 1 ,BH001,56,F,,,,AM,N,133,7.4,211,101,0.389,5,145,3.6,8.9,103,66,45,21,18,99,27,3.3,Y,Y,Y,N,N,Y,N,N,N,N,N,N,N,AFL,Y,N,N,N,N,II,4.7,35,NON-ISCH,OPTIMAL,0.075455,,0.056684,0.0046248,0.075409,0.084822,3.297,0.049906,0.012693,0.0083952,,0.044318,0.8368,0.44693,,0.06162,0.025508,,0.035867,0.025508,0.0030233,0.12994,0.0053389,0.011634,0.0079132,0.040271,0.12019,0.029855,0.0042757,0.023371,0.11909,0.039038,0.076312

2,HF2,Disease,258,BM 2,BM002,76,F,20,N,M,AM,N,144,5.8,238,104,0.415,4.7,141,3.7,4.8,105,69,44,25,18,68,11,4.9,Y,Y,Y,N,N,Y,N,Y,N,N,N,N,N,AF,Y,N,Y,N,N,II,5,30,NON-ISCH,OPTIMAL,0.10878,258,0.067644,0.0031825,0.17473,0.091711,3.1539,0.037649,0.013715,0.011757,0.015807,0.059546,0.85288,0.55551,0.0037882,,,0.19092,0.034043,,0.0045865,0.0017557,0.0075377,0.036367,0.015971,0.046745,0.10133,0.027483,0.0061129,0.010091,0.045538,0.053389,0.32082

3,HF3,Disease,291,JD 3,JD003,57,F,27,N,M,PM,N,128,5,191,100,0.381,4.2,142,4.5,8.7,86,85,42,43,27,59,7,4,Y,Y,Y,N,N,Y,N,N,N,N,N,N,N,,Y,N,N,N,N,II,,25,NON-ISCH,MILD OVER,0.073152,291,0.044853,,0.046114,0.10021,3.1432,0.041029,0.014252,0.0050932,0.022634,0.050178,0.82786,0.55497,0.0055495,0.093474,0.039044,0.058624,0.038942,0.039044,0.0025973,0.14137,0.011345,0.020403,0.019848,0.049613,0.11345,0.021746,0.001524,0.093776,0.066123,0.032599,0.15415

4,HF4,Disease,567,BW 4,BW004,62,F,30,X,M,AM,N,143,5.1,137,87,0.411,4.3,143,3.3,11.8,117,71,45,26,19,70,7,4.9,Y,N,Y,Y,N,N,Y,N,N,N,Y,N,Y,,N,N,N,N,N,II,7,20,NON-ISCH,OPTIMAL,0.10796,567,0.036054,0.0018632,0.19866,0.10902,4.1503,0.039065,0.015666,0.0097238,0.025385,,1.0623,0.69678,0.0073338,,0.064667,0.29358,,0.064667,0.0042544,0.16379,0.0095992,0.014121,0.0089761,0.15622,0.077569,,0.0077044,0.21553,0.07522,0.036448,0.17207

5,HF5,Disease,1222,RY 5,RY005,61,M,20,Y,M,AM,N,149,16.4,428,102,0.441,4.8,135,3.6,6.9,128,67,42,25,29,60,8,5.8,N,Y,N,N,N,N,Y,N,N,N,N,N,Y,,N,Y,N,N,N,II,6.6,30,NON-ISCH,OPTIMAL,0.11123,1222,0.058901,0.0057741,,0.15671,2.4351,0.034232,0.021121,0.008371,0.017146,0.074445,0.71129,0.36763,0.0021197,0.093938,0.044783,0.067372,0.021486,0.044783,,0.22216,0.016023,,,0.062971,0.082648,0.034864,0.011848,0.17598,0.044657,,0.0038244

6,HF6,Disease,894,RH 6,RH006,78,M,23,X,M,AM,N,147,8.5,201,92,0.45,4.3,139,4.2,14.1,141,75,45,30,14,85,13,2.8,Y,N,Y,N,N,Y,N,Y,N,N,N,N,N,AF,N,N,N,Y,Y,III,,25,ISCHAEMIC,DEHYD,0.14844,894,0.05826,0.0028865,0.072994,0.046987,1.8706,0.043899,0.056454,0.013181,0.031476,0.12868,0.48139,1.5786,0.0071046,0.056606,0.075311,0.45278,0.0094623,0.075311,,0.29205,0.011703,0.10632,0.013623,0.067309,0.19402,,0.0092435,0.046347,0.132,0.07865,0.29445

7,HF7,Disease,189,CB 7,CB007,61,M,32,X,M,AM,N,156,7.2,128,100,0.464,10.9,141,4.1,8.3,84,71,41,30,40,72,13,3.5,Y,Y,Y,N,N,Y,N,Y,N,N,N,N,N,,N,Y,N,Y,N,II,7.9,20,ISCHAEMIC,OPTIMAL,0.072934,189,0.059544,0.015263,0.056735,0.092759,4.0049,0.03716,0.013046,0.032684,0.022715,,0.00066042,0.50844,,0.072489,,0.18044,0.044896,0.034734,,0.15046,0.010753,0.018995,0.016751,0.15922,0.15052,0.018269,0.0089176,0.013683,0.10421,0.042742,0.4572

8,HF8,Disease,,JR 8,JR008,73,M,24,N,M,AM,N,130,4.5,166,101,0.39,5.9,140,5.1,15.8,171,70,43,27,25,78,15,3.5,Y,Y,Y,Y,N,N,N,Y,N,N,N,N,N,,Y,N,N,N,N,II,7.5,25,ISCHAEMIC,OPTIMAL,0.12892,,0.050998,,0.15833,0.3295,3.014,0.036938,0.046056,0.0095859,0.036859,0.10625,0.80384,1.1235,0.0076209,0.21843,0.072685,0.26845,0.0404,0.072685,0.0051617,,0.010444,0.36369,0.014823,0.1356,0.00014761,,0.007421,0.072735,0.064676,0.061279,0.1497

9,HF9,Disease,263,JB 9,JB009,73,M,19,N,M,AM,N,141,6.6,142,98,0.42,4.4,145,4,12.5,206,71,43,28,30,107,13,5.7,Y,Y,Y,N,N,N,N,N,N,N,N,N,N,,Y,Y,Y,N,N,II,6.4,35,ISCHAEMIC,OPTIMAL,0.11986,263,0.052495,0.0021299,0.13939,0.26981,3.9273,0.052322,0.0011439,0.0094393,0.034055,0.1151,1.0352,0.84377,0.0095589,0.10002,0.064658,0.79267,0.021808,0.064658,0.0069851,0.2106,0.0081114,0.046973,0.016258,0.11417,0.13116,,0.0067835,0.044293,,0.083744,0.34847

10,HF10,Disease,166,BW 10,BW010,60,F,30,X,M,AM,N,147,7.7,277,99,0.426,5.7,144,3.7,6,95,70,44,26,21,129,8,4,Y,Y,N,N,N,N,Y,N,N,N,N,N,N,,N,Y,N,N,N,II,7.5,25,ISCHAEMIC,OPTIMAL,0.092718,166,0.038311,0.0048812,,0.12387,3.0988,0.050454,0.01694,0.014162,0.01789,0.059974,0.8148,0.71116,0.0051911,0.16067,0.029084,0.052568,0.02858,0.029084,0.0032492,0.1274,0.010893,0.063072,0.030869,0.038119,0.15602,,0.0078366,0.040316,0.10217,0.059428,0.30476

11,HF11,Disease,38,AW 11,AW011,71,M,35,X,M,AM,N,136,7.5,310,98,0.386,4.9,143,4,8.3,106,64,39,25,30,71,7,3.1,Y,Y,Y,N,Y,N,Y,Y,N,N,N,N,N,,N,Y,N,N,N,II,6.2,30,ISCHAEMIC,OPTIMAL,0.063924,38,0.027595,0.0018068,0.028793,0.078118,3.5781,0.028453,0.011002,0.0078755,,0.03658,0.91398,0.47301,0.00469,0.11739,0.014736,0.034244,0.039066,0.014736,,,0.034017,0.033923,0.0055543,0.087465,0.089307,0.023227,0.026896,0.064956,0.093049,0.023381,0.056844

12,HF12,Disease,160,KM 12,KM012,59,M,32,X,N,AM,N,144,8.8,208,106,0.42,10.6,143,3.9,7.6,100,77,44,33,20,77,10,2,Y,Y,Y,N,N,Y,N,Y,I,Y,N,N,N,AF,N,N,Y,Y,Y,II,5.8,30,NON-ISCH,OPTIMAL,0.06837,160,0.046158,0.012927,,0.1633,,0.038205,0.020569,0.0086759,0.017757,,0.45343,0.88439,0.0032779,,0.045827,0.035102,,0.045827,0.0033131,,0.013702,0.14889,0.023989,,0.099619,,0.0098675,0.022237,0.14267,0.043297,0.15402

13,HF13,Disease,31,PK 13,PK013,62,F,35,X,N,AM,N,131,11.2,247,33,0.376,6.5,133,3.7,22.4,110,77,40,37,19,203,6,3.5,Y,Y,Y,Y,N,N,Y,Y,I,Y,N,N,Y,,N,N,Y,N,N,II,6.4,25,ISCHAEMIC,OPTIMAL,0.086323,31,0.045052,0.0061603,,0.13611,2.4994,0.044935,0.00248,0.013509,0.023235,,0.63068,0.74881,0.0041407,,0.014041,0.12747,0.023101,0.014041,,0.21491,0.0072041,,0.018591,0.080196,0.046651,0.023369,0.0020328,0.02826,0.058188,0.04338,0.37348

14,HF14,Disease,26,JH 14,JH014,86,M,25,X,N,AM,N,129,6.7,206,90,0.372,4.9,137,4.1,9.2,120,79,46,33,19,60,10,4.1,Y,Y,Y,N,N,N,Y,Y,N,N,N,N,N,,N,N,N,N,N,II,6,25,ISCHAEMIC,OPTIMAL,0.13206,26,0.039485,0.0042373,0.1144,0.23191,4.1704,0.034418,0.031198,0.0068367,0.022975,0.10071,1.0706,1.1309,0.004897,0.30271,0.085665,0.079493,0.030997,0.085665,0.0045801,0.5303,0.011557,0.020481,0.03553,0.1041,,0.13529,0.0083167,0.059833,0.080151,0.076684,0.30953

16,HF16,Disease,1119,JC 16,JC016,62,M,22,N,N,AM,N,142,9,204,73,0.47,5.2,138,4.3,13.6,113,72,42,30,18,111,27,2.8,N,Y,Y,N,N,N,N,N,N,N,Y,N,N,,N,N,N,N,Y,III,7.8,20,ISCHAEMIC,OPTIMAL,0.12847,1119,0.1906,0.0023264,,0.14866,,0.065114,0.024105,0.007251,0.030483,0.10965,1.4334,0.86411,0.0094594,0.082182,0.049939,0.29528,0.02584,0.049939,0.0050427,0.19702,0.0086112,0.021601,0.0056792,0.099638,0.27322,,0.0069421,0.049742,0.085742,0.029575,0.13499

17,HF17,Disease,,MB 17,MB017,82,F,29,N,M,PM,N,110,8.2,375,91,0.341,5.9,136,3.7,12.6,158,78,38,40,35,165,19,3.9,Y,Y,Y,N,N,Y,N,Y,N,N,N,N,N,,N,Y,N,N,N,III,6.4,15,ISCHAEMIC,MILD OVER,0.2227,,0.10978,0.0084597,0.56989,0.30219,4.3907,0.050235,0.044497,0.019829,0.034663,,,1.3966,0.016663,0.10469,0.061035,0.47549,0.047572,0.061035,0.0085019,0.17919,0.0064391,0.035958,0.0032533,0.097865,0.18003,0.089636,0.0053634,0.026519,0.084729,0.054982,0.081225

18,HF18,Disease,397,LB 18,LB018,46,M,36,X,M,AM,N,,,,,,,,,,,,,,,,,,N,Y,Y,Y,N,Y,Y,N,N,N,N,N,N,AF,N,N,N,N,Y,III,7.9,25,NON-ISCH,DEHYD,0.094766,397,0.12225,0.0095598,0.17963,0.13427,4.0226,0.067176,0.021754,0.028967,0.037268,,1.0348,0.96979,0.006288,0.062125,0.035697,0.28117,0.018574,0.057246,0.0041017,,0.023235,0.024661,0.0089761,,0.24406,,0.018291,0.45389,0.25916,0.041702,0.24281

19,HF19,Disease,4100,GJ 19,GJ019,54,M,29,X,M,AM,N,146,,150,96,0.459,5.5,141,4.8,30.5,337,77,43,34,13,113,25,3,Y,N,Y,Y,N,Y,N,N,N,N,N,N,N,,Y,N,N,N,Y,II,7.7,25,NON-ISCH,OPTIMAL,0.38706,4100,0.064676,0.0050718,,,2.462,0.033635,,0.01457,,0.32452,0.62895,2.271,0.0063734,0.18153,0.16856,0.23524,0.0090342,0.16856,0.012064,0.33504,0.017349,0.15048,0.0087864,0.1113,0.17896,0.051623,0.013741,0.12512,,0.14266,0.11785

20,HF20,Disease,,SH 20,SH020,61,M,26,N,M,PM,N,155,6.8,222,94,0.453,6.4,142,3.5,7.7,109,79,47,32,24,92,20,6,Y,Y,Y,N,N,Y,N,Y,N,N,N,N,N,,Y,Y,Y,Y,N,II,6.5,30,ISCHAEMIC,OPTIMAL,0.12514,,0.068957,0.0055604,0.15316,0.15733,3.9379,0.040303,0.02151,0.0076645,0.023408,,,0.87002,0.0059436,,0.034322,0.058598,0.044912,0.034322,,0.1492,0.019741,0.031661,0.01278,0.080303,0.13582,0.035943,0.013784,0.022482,0.13641,0.044469,0.10282

21,HF21,Disease,546,PT 21,PT021,61,M,24,X,N,AM,N,159,8.3,281,96,0.522,8.3,142,4.6,9.5,112,77,46,31,16,101,45,2.6,N,N,Y,Y,N,N,Y,Y,N,N,N,N,Y,,N,N,N,N,Y,II,6.6,15,ISCHAEMIC,OPTIMAL,0.12908,546,0.16518,0.0095358,0.069165,0.14226,4.0676,0.088657,0.0197,0.010177,0.026306,0.084729,,0.59853,,0.24758,0.061689,0.064159,0.022661,0.061689,,0.41048,0.066603,0.016077,0.0017157,0.060302,0.22257,0.048696,0.0023079,0.0096683,0.1335,0.036274,0.024463

22,HF22,Disease,308,RC 22,RC022,76,M,26,N,M,AM,N,129,9.7,309,90,0.396,5.6,141,4.6,18.7,172,82,48,34,25,72,8,5.7,Y,Y,Y,N,N,N,N,Y,N,N,N,N,N,,N,N,N,N,N,II,,20,ISCHAEMIC,OPTIMAL,0.1958,308,0.048558,0.0038518,0.16856,0.39346,5.5439,0.032871,0.060865,0.020156,0.046996,0.11826,1.3575,1.1172,0.0065989,0.099917,0.092786,0.4876,0.036172,0.092786,0.0083994,0.58593,0.010404,0.032448,,0.15127,0.19365,,0.0081915,0.036012,0.22454,0.076132,0.10398

23,HF23,Disease,1497,KN 23,KN023,65,M,26,X,M,AM,N,127,8.7,285,98,0.394,11.8,138,5.1,12.3,148,71,44,27,31,59,16,2.9,Y,Y,Y,N,N,Y,Y,Y,Metformin,Y,N,N,N,AFL,N,N,Y,N,N,II,6.5,25,ISCHAEMIC,OPTIMAL,0.16808,1497,0.092993,0.0097317,0.09611,0.35397,2.544,0.039321,0.048657,0.025681,0.032893,,0.67744,1.1282,0.02263,,0.085477,0.1297,0.023027,0.085477,0.005969,0.26245,0.031253,0.11139,0.0047838,0.26983,0.17437,0.062319,0.021626,0.018516,0.12255,0.046393,0.061369

24,HF24,Disease,49,TP 24,TP024,53,M,38,Y,E,AM,N,142,5.5,193,93,0.414,12.3,139,4.1,7.9,78,68,42,26,20,75,8,3.3,Y,Y,Y,N,N,N,Y,Y,Metformin,Y,N,Y,N,,N,N,N,N,N,II,6.6,35,ISCHAEMIC,OPTIMAL,0.062827,49,0.053969,0.0066815,,0.082076,0.44809,0.030698,0.010882,0.014551,,0.038114,0.63369,,0.01374,0.054165,,0.033516,0.026743,0.022976,,0.68057,0.0081512,,,0.35173,0.084837,0.015763,0.0068791,0.010335,0.1498,0.015976,0.022077

25,HF25,Disease,33,SL 25,SL025,78,M,31,N,M,AM,N,,,,,,18,139,4.2,10.7,143,77,45,32,17,95,10,3.8,Y,Y,Y,N,Y,N,Y,Y,N,N,N,N,N,,N,N,Y,N,N,II,4.8,45,ISCHAEMIC,OPTIMAL,0.10703,33,0.054865,0.0058585,0.14859,0.17877,2.4,0.038722,0.023478,0.03303,,,0.61105,0.84807,,,,0.52286,0.01306,0.061622,0.0050857,0.11719,0.01263,,,0.10709,,0.028641,0.013015,0.37856,0.1049,0.034001,0.071774

26,HF26,Disease,1569,PR 26,PR026,69,M,27,N,M,AM,N,130,9.2,452,97,0.429,4.7,144,3.5,9,188,79,44,35,19,84,16,3.5,N,Y,N,Y,N,N,Y,Y,N,N,N,N,N,,N,N,N,N,N,II,7.1,35,ISCHAEMIC,OPTIMAL,0.14608,1569,0.045615,,0.082327,0.32235,3.6936,0.042971,0.023572,0.006327,,0.091906,,1.1166,0.0093274,0.077336,0.045281,0.11582,0.024112,0.045281,0.005284,0.45044,0.0084378,0.22873,0.017108,0.080321,0.13959,,0.0059567,0.044761,0.068789,0.10604,0.15145

27,HF27,Disease,,GG 27,GG027,73,M,24,N,M,AM,N,139,7,157,92,0.423,7.4,137,7.6,55.9,266,80,49,31,47,189,19,3.4,Y,Y,Y,Y,N,Y,Y,Y,N,N,N,N,N,AF,N,N,N,N,N,II,6.5,25,ISCHAEMIC,OPTIMAL,0.57405,,0.060371,,0.98301,0.17962,,0.036314,0.074233,0.0044156,0.087945,0.47457,1.085,2.4038,0.016248,0.13276,0.2377,0.20255,,0.2377,,4.7925,0.076048,0.18401,0.0049317,0.074462,,0.054625,0.056093,0.30646,0.23332,0.16325,0.044402

28,HF28,Disease,251,WJ 28,WJ028,75,M,26,N,E,AM,N,155,8.6,188,101,0.444,6.4,143,3.7,9.2,140,73,48,25,13,112,15,4.5,N,Y,Y,N,N,Y,N,Y,N,N,N,N,Y,,Y,N,N,N,N,II,6.1,30,NON-ISCH,OPTIMAL,0.10824,251,0.046695,0.0057977,0.09305,0.12069,0.71724,0.036424,0.016251,0.016386,0.019669,,0.31009,0.74614,0.0031988,,0.042045,0.058995,0.027872,0.042045,,0.14338,0.0076475,,0.010634,0.028801,0.13498,0.023884,0.0052701,0.10464,0.18003,0.060744,0.1026

29,HF29,Disease,188,JD 29,JD029,69,M,20,N,M,AM,N,139,4.3,210,93,0.394,4.6,143,4.3,7,109,66,44,22,24,110,12,4.1,Y,Y,N,N,N,Y,N,Y,N,N,N,N,N,AF,Y,N,N,N,Y,II,5.9,30,ISCHAEMIC,OPTIMAL,0.064889,188,0.028193,0.0017325,0.089707,0.096273,2.8032,0.040518,0.012574,0.0085037,0.018773,0.040012,0.74108,0.57162,0.0026907,,0.032074,0.35967,0.011865,0.032074,0.0035869,0.082167,0.00679,0.03936,0.0098547,0.043414,0.12574,0.020495,0.0049636,0.029574,0.082786,0.03805,0.19434

30,HF30,Disease,118,KS 30,KS030,65,M,27,N,M,AM,N,162,72,219,90,0.446,5.7,143,3.6,6.3,88,75,46,29,45,59,12,4.5,Y,Y,Y,N,N,Y,N,Y,N,N,N,N,N,AF,N,N,N,N,Y,II,5.5,18,NON-ISCH,OPTIMAL,0.060523,118,0.085999,0.0036771,0.068093,0.088652,3.3908,0.032243,0.012109,0.0041759,0.016084,,0.88179,0.80985,,0.1243,0.028584,0.026067,0.019884,0.028584,,,0.014838,,0.026965,0.057832,0.15186,,0.010772,0.01596,0.1894,0.046406,0.16975

31,HF31,Disease,1694,FS 31,FS031,78,M,34,Y,M,AM,N,118,5.1,219,93,0.363,21.4,140,4.2,13,200,76,41,35,15,131,10,3.7,Y,N,Y,N,N,N,Y,Y,I,Y,N,N,N,,N,N,N,N,N,III,,30,ISCHAEMIC,OVER,0.19641,1694,0.10283,0.0078349,0.23064,0.59592,3.9192,,0.076381,0.011055,,,1.0125,1.4878,0.0085488,0.2051,,0.15066,0.050053,,,0.56382,0.036063,0.24463,0.017523,,0.156,,0.010353,0.25947,,0.094195,0.17415

32,HF32,Disease,305,EY 32,EY032,84,M,33,N,N,AM,N,161,9.4,221,95,0.457,5.7,142,4.2,12.1,178,69,42,27,22,96,18,3.3,Y,Y,Y,N,N,N,Y,Y,N,N,Y,N,N,,N,N,N,N,N,II,5.6,30,ISCHAEMIC,OPTIMAL,0.15217,305,,0.0070323,0.099741,0.24318,4.3497,0.033445,0.036336,0.017974,0.030072,0.12928,1.1342,1.3405,0.0052576,0.10351,0.063421,0.1828,0.036487,0.063421,0.0057869,0.1778,0.016868,0.020383,0.0091282,0.19497,0.19803,,0.013827,0.066411,0.14345,0.08278,0.22625

33,HF33,Disease,53,JK 33,JK033,69,M,31,N,M,AM,N,129,8.8,323,86,0.378,16.4,137,5.2,9.8,120,69,42,27,24,76,6,5.1,Y,Y,Y,N,N,N,Y,Y,Metformin/Gliclazide,Y,Y,N,N,,N,N,N,N,N,II,6.4,30,ISCHAEMIC,OPTIMAL,0.078153,53,0.040616,0.0092539,0.10634,0.16257,3.4984,0.020143,0.022472,0.019893,0.024386,0.071842,0.9299,0.64115,0.0050796,0.076384,0.030672,0.04322,0.020605,0.030672,,0.23004,0.0078299,0.021643,0.0093331,0.20001,0.16235,,0.0062531,0.0031696,0.13973,0.024623,0.20104

34,HF34,Disease,264,AA 34,AA034,59,M,30,N,E,AM,N,143,4.7,164,101,0.419,4.9,140,4.4,5.2,72,73,42,31,22,101,18,5,Y,Y,Y,N,N,Y,Y,Y,N,N,N,N,N,,N,N,N,N,N,II,7.9,25,NON-ISCH,OPTIMAL,0.070964,264,0.063218,0.0095738,0.12429,0.15609,3.3984,0.045168,0.022803,0.012304,0.013265,,0.93885,0.72232,0.0034519,0.072119,0.043211,,0.036593,0.043211,0.0030138,0.022954,0.0059461,,0.0036371,0.064917,0.16709,0.025633,0.0047866,0.016251,0.092508,0.024749,0.068338

35,HF35,Disease,197,GB 35,GB035,79,M,20,N,M,AM,N,144,7.8,135,94,0.43,7.2,144,4.1,7.7,116,65,43,22,17,82,13,3.9,Y,Y,Y,N,N,Y,N,Y,N,Y,N,N,N,,N,N,Y,N,N,II,6.4,30,ISCHAEMIC,OPTIMAL,0.1017,197,0.047125,0.0041766,,0.15862,3.0802,0.034257,0.022208,0.010874,,,0.77165,0.80657,0.002858,,0.079098,0.1755,0.036288,0.079098,0.0046388,0.32391,0.0066306,0.03884,0.0053731,0.09996,0.093795,0.043417,0.004565,0.0072563,0.061671,0.039662,0.067617

36,HF36,Disease,955,ER 36,ER036,72,F,30,N,N,AM,N,,,,,,5.3,145,4.7,7.9,106,69,43,26,36,216,12,3.3,Y,Y,Y,N,N,Y,N,Y,N,N,N,N,N,AF,N,N,N,N,N,II,6.7,35,NON-ISCH,MILD OVER,0.093523,955,0.039403,0.0047852,,0.10678,,0.030051,0.014523,0.0083121,0.020662,0.052248,0.67404,0.58256,0.0086168,,0.036863,0.054069,0.0171,0.036863,0.0027704,,0.019286,,,0.18856,0.1225,0.028577,0.013564,0.035243,0.16541,0.024668,0.015443

37,HF37,Disease,71,LG 37,LG037,72,M,27,Y,M,AM,N,147,12.8,298,93,0.446,5.3,141,4.7,99,135,77,45,32,17,141,8,4.3,Y,Y,Y,N,N,N,Y,Y,N,N,Y,N,N,,N,N,N,N,N,II,5.8,30,NON-ISCH,OPTIMAL,0.11469,71,0.035117,0.0055197,0.080944,0.17936,3.5189,0.02831,0.025509,0.019216,0.027277,0.091152,0.90837,0.86954,0.0052486,,0.035092,0.26364,0.028945,0.035092,0.0065973,0.23502,0.016346,0.026812,0.0042284,0.14085,0.14377,0.025411,0.012546,0.10636,0.09298,0.062467,0.10014

38,HF38,Disease,1410,GM 38,DM038,83,M,20,N,N,AM,N,128,6,162,92,0.39,5.2,138,4.1,12.6,167,78,48,30,19,94,25,2.9,Y,Y,Y,N,N,N,Y,Y,N,N,N,N,N,,N,N,Y,N,N,II,5.6,30,ISCHAEMIC,OPTIMAL,0.10457,1410,0.048094,,0.22618,0.13909,2.3789,0.030321,0.021399,0.0062506,0.024405,0.082381,0.64053,0.79869,0.0087966,0.16586,0.049298,0.075378,0.039982,0.049298,,0.4217,0.014721,0.037952,0.0032463,0.10558,0.1698,0.064793,0.011812,0.064448,0.091273,0.050379,0.041224

39,HF39,Disease,399,JM 39,JM039,77,M,26,N,M,AM,N,144,6.8,129,93,0.413,10.8,138,4.6,14.2,147,73,45,28,12,106,9,4.3,Y,N,Y,Y,N,N,Y,Y,Glibenclamide,Y,N,N,N,,Y,N,N,N,N,II,7.1,25,ISCHAEMIC,OPTIMAL,0.10903,399,0.062895,0.0041753,0.1532,0.27738,3.3747,0.036173,0.037842,0.0080774,0.039538,0.11709,0.87917,0.93664,0.018706,,0.065706,0.065178,0.014343,0.065706,,0.35224,0.018423,0.02838,0.012709,0.027978,0.14386,,0.01414,0.088673,0.20818,0.068947,0.17353

40,HF40,Disease,366,KM 40,KM040,82,F,27,N,M,AM,N,135,4.4,127,98,0.397,5.2,145,4.3,24.4,194,75,41,34,15,80,8,3.2,Y,Y,N,Y,N,N,Y,Y,N,N,N,Y,N,,N,N,N,N,N,III,7,30,ISCHAEMIC,MILD OVER,0.26638,366,0.041215,0.0030202,0.73082,0.33253,4.7013,0.041352,0.095457,0.023204,0.057659,0.19015,1.2313,1.6157,0.011921,,0.099643,0.37157,0.021667,0.099643,,0.53981,,0.048605,0.0028166,0.080233,0.14039,0.032099,0.0030274,0.049163,,0.10371,0.090297

41,HF41,Disease,86,FC 41,FC041,78,M,34,N,M,AM,N,135,8,296,102,0.397,12.1,139,4.6,10.2,152,63,40,23,22,97,10,3.3,N,Y,Y,Y,N,Y,Y,Y,N,N,N,N,N,,N,N,Y,N,Y,II,6,30,ISCHAEMIC,OPTIMAL,0.1132,86,0.062612,0.0040513,0.17014,0.15318,4.5488,0.025772,0.021427,0.0086476,0.022895,0.070184,0.60809,0.91038,0.0040513,0.14734,,0.039634,0.026661,,,0.36347,0.009522,0.014347,0.0090009,0.070861,0.13554,,0.0076922,0.012727,0.17798,0.050999,0.10596

42,HF42,Disease,914,GB 42,GB042,78,M,17,N,M,AM,N,155,14.7,628,86,0.456,4.6,137,3.3,14.6,126,71,45,26,39,96,13,4.7,Y,N,Y,N,N,Y,N,N,N,N,Y,N,Y,AF,N,N,N,N,N,II,6.1,30,ISCHAEMIC,OPTIMAL,0.20687,914,0.070394,0.0014339,0.5538,0.50638,3.3257,0.037392,0.072573,0.0077208,0.00046146,0.20161,0.86729,1.1464,0.023227,,0.047009,0.2058,0.037988,0.10197,0.0082565,0.50874,0.048872,0.0441,,0.090848,0.25708,0.062829,0.038065,0.28683,0.24736,0.069046,0.011589

43,HF43,Disease,235,VP 43,VP043,67,M,36,X,N,AM,N,182,8,221,89,0.549,5.3,142,4.2,11.5,112,76,47,29,37,94,16,4.2,Y,Y,Y,N,N,N,Y,Y,N,N,N,N,N,,N,N,N,N,N,III,7,25,ISCHAEMIC,OPTIMAL,0.096778,235,0.061293,0.0058886,,0.13357,3.8792,0.043168,0.016675,0.0069314,0.034286,,0.99151,0.65596,0.0042136,0.17375,0.032074,0.1012,0.041684,0.032074,0.0041402,0.34528,0.0032357,,0.0026315,0.21313,0.14213,0.032424,0.002324,0.021141,0.17792,,0.01992

44,HF44,Disease,463,WT 44,WT044,81,M,22,N,N,AM,N,150,12.5,193,94,0.441,5.2,137,4.8,20.2,157,76,46,30,22,118,17,2.4,Y,Y,Y,Y,N,Y,Y,Y,N,N,N,N,N,,Y,N,N,N,Y,III,6,30,ISCHAEMIC,MILD DEHYD,0.25746,463,0.045394,0.0041627,0.12628,0.36082,4.2379,0.03539,0.065623,0.023386,0.067014,0.17771,1.0883,1.2715,0.0059904,0.10014,0.038088,0.37139,0.035407,0.07383,0.0084832,0.99302,0.032463,0.073996,,,0.2054,0.030561,0.024809,0.09568,0.17938,0.09381,0.14215

45,HF45,Disease,17,RM 45,RM045,60,M,26,N,M,AM,N,145,8,312,93,0.446,5,144,4.4,11.3,161,78,51,27,41,88,10,5.4,Y,Y,N,N,N,N,Y,Y,N,N,N,N,Y,,Y,Y,N,N,N,II,6.1,35,ISCHAEMIC,OPTIMAL,0.078634,17,0.040854,0.0018776,,0.14439,2.4898,0.041376,0.020068,0.0065603,0.034647,,0.65057,0.5591,0.0033224,0.11799,0.03241,0.079993,0.028458,0.03241,,0.59305,0.018562,,0.0076487,0.063336,0.097379,,0.013435,0.14327,0.1338,0.032145,0.093164

46,HF46,Disease,611,RR 46,RR046,65,M,33,X,M,AM,N,160,8.6,198,86,0.492,6.5,145,3.6,27.6,352,70,41,29,11,79,14,3.7,Y,N,Y,N,N,N,N,Y,N,N,N,N,N,,Y,N,N,Y,N,III,7.6,20,NON-ISCH,OPTIMAL,0.37707,611,0.09816,0.0117,0.55258,,3.6196,0.054862,,0.031815,0.064695,0.39216,0.94961,1.8468,0.060066,0.18532,0.13563,0.27897,0.016151,0.13563,,0.6839,,0.036235,,0.072395,0.22603,0.065167,,0.25931,0.34472,0.1149,0.045023

47,HF47,Disease,371,FN 47,FN047,74,M,27,N,M,AM,N,127,10,203,97,0.389,5.1,142,4.7,10.2,108,71,43,28,38,42,11,3.9,Y,Y,Y,N,N,N,N,Y,N,N,N,N,N,,Y,N,Y,N,N,IV,7.6,15,ISCHAEMIC,OPTIMAL,0.067698,371,0.025501,0.0032761,0.08429,0.1207,2.9801,0.023405,0.018639,0.0072409,0.021328,0.059252,0.81847,0.60424,0.0050417,0.083022,0.030803,0.057451,0.016985,0.030803,0.0033144,0.12531,0.0093097,0.014385,0.0074728,0.26485,0.10931,0.027896,0.00749,0.04704,0.061817,0.030898,0.076088

48,HF48,Disease,664,CB 48,CB048,69,M,24,N,M,AM,N,153,5.6,167,89,0.463,6.3,144,3.9,8.3,114,70,40,30,19,75,10,5,Y,Y,Y,N,N,Y,N,Y,N,N,Y,N,N,,Y,N,N,N,N,II,7.2,20,NON-ISCH,OPTIMAL,0.10031,664,0.041979,0.0093979,,0.12786,2.1736,0.043014,0.015669,0.009013,0.024838,0.060477,0.55195,0.70203,0.0049452,,,0.06631,0.025389,0.041367,0.0037047,0.14726,0.026231,,0.0047716,0.10909,0.076029,0.036831,0.017072,0.079915,0.083781,0.026931,0.035612

49,HF49,Disease,580,RE 49 ,RE049,86,M,27,N,N,AM,N,129,6.2,262,89,0.381,4.3,145,3.8,8,159,67,42,25,16,58,16,4.1,Y,Y,Y,N,N,N,N,N,N,N,Y,N,Y,,N,N,N,Y,N,II,6.8,25,NON-ISCH,OPTIMAL,0.15061,580,0.037533,0.0023453,0.10655,0.23346,3.8159,0.042758,0.03437,0.006455,0.029413,0.11768,0.98496,0.94718,0.0056298,0.062267,0.066947,,0.018456,0.066947,0.0067146,0.16214,0.020972,0.02625,0.0066408,0.090243,0.18633,0.047002,0.014852,0.098733,0.12799,0.050374,0.12759

50,HF50,Disease,82,AT 50,AT050,48,M,28,N,M,AM,N,158,8.3,236,87,0.446,5.1,140,4.9,8.3,110,78,47,31,69,108,10,3.5,Y,Y,Y,Y,N,N,Y,Y,N,N,N,N,N,,N,N,N,N,N,II,6.6,25,ISCHAEMIC,OPTIMAL,0.074825,82,0.054163,0.0045751,0.016809,0.094564,3.2132,0.036719,0.01343,0.014876,0.023066,0.042333,0.80833,0.68248,0.002805,0.10171,0.035281,0.086708,0.012717,0.035281,0.0030008,0.18388,0.0019659,0.021385,0.018066,0.066258,,,,0.01406,0.1662,0.033657,0.22289

51,HF51,Disease,5,RB 51,RB051,47,M,34,N,M,AM,N,162,6.7,239,90,0.449,6,140,3.8,8.2,92,83,51,32,33,64,10,7.3,Y,Y,Y,Y,N,Y,N,N,N,N,N,N,N,,N,N,N,N,Y,II,7,25,NON-ISCH,OPTIMAL,0.063162,5,0.057758,0.0098649,0.042967,0.13325,3.4436,0.043492,0.017169,0.0080509,0.022669,0.048654,0.86666,0.74998,0.0032158,,0.026301,,0.037679,0.026301,,0.15859,0.0074303,0.039971,0.02568,0.055338,0.092283,0.017478,0.0053608,0.13355,0.17014,0.060753,0.1656

52,HF52,Disease,446,PT 52,PT052,58,M,20,N,M,AM,N,159,8.6,238,93,0.46,4.5,140,4.1,2.6,70,73,45,28,21,83,7,3.9,Y,Y,N,N,N,N,Y,Y,N,N,N,N,N,,N,N,N,N,N,II,7,25,NON-ISCH,OPTIMAL,0.033173,446,0.017931,,0.020485,0.030098,1.1628,0.012436,0.0043626,0.0042675,,0.016336,0.37604,0.25758,,0.039775,0.0082417,,0.014686,0.0082417,,0.035799,0.002866,0.0085099,0.00082412,0.017532,0.049962,0.01129,0.0022758,0.078736,0.049349,0.007475,0.0094129

53,HF53,Control,,BH 1,BH 1,83,F,25,N,N,AM,N,111,7.4,354,83,0.34,4.4,132,4.6,5.4,88,69,44,25,7,73,6,5.7,N,Y,Y,,N,N,N,N,N,N,N,N,N,NORMAL,N,N,N,N,N,,,,,,0.059068,,0.01919,0.0021111,0.054065,0.05378,0.30149,0.023784,0.008126,0.0073149,0.011537,0.037028,0.31398,0.70669,0.002422,0.03695,0.024265,0.022912,0.033779,0.024265,,0.12767,0.0058989,0.014252,0.016001,0.051572,0.08351,0.0084094,0.0045897,0.037404,0.048816,0.045229,0.17133

54,HF54,Control,32,RC 2,RC 2,76,M,25,N,M,AM,N,151,6.8,209,90,0.44,5.5,146,4.1,4.7,91,70,46,24,18,88,9,6.7,N,N,N,,N,N,N,N,N,N,N,N,N,NORMAL,N,N,N,N,N,,,,,,0.042852,32,0.023533,0.0028671,0.033607,0.058771,1.1663,0.021781,0.0080672,0.0089754,0.011074,0.026801,0.31255,0.47242,0.0019611,0.022532,0.015049,,0.013578,0.047419,0.0027374,0.1053,0.0017678,0.010983,0.015144,,0.064595,0.0067359,0.0013695,0.0034578,0.052033,0.024961,0.33146
